MokoMakeFile "Build Ends in Tragedy"

Al Johnson openmoko at
Mon Sep 15 17:46:58 CEST 2008

On Monday 15 September 2008, SCarlson wrote:
> Applying patch scrolled_view-drag.patch
> patching file etk/core/scrolled_view.pxi
> Hunk #1 succeeded at 43 with fuzz 2 (offset 24 lines).
> patching file include/etk/scrolled_view.pxd
> Hunk #1 FAILED at 21.
> 1 out of 1 hunk FAILED -- rejects in file include/etk/scrolled_view.pxd
> Patch scrolled_view-drag.patch does not apply (enforce with -f)
> ERROR: Task 3196
> (/home/scott/code/mokobuild/openembedded/packages/python/,
> do_patch) failed
> NOTE: Tasks Summary: Attempted 3146 tasks of which 0 didn't need to be
> rerun and 1 failed.
> '/home/scott/code/mokobuild/openembedded/packages/python/'
> failed
> NOTE: build 200809141252: completed
> make: *** [openmoko-asu-image] Error 1

I think this has been reported already, and a fix should be on the way. The 
patch that is being applied by the .bb doesn't need to be any more as it has 
been included upstream. The .bb just needs to be updated to reflect this, and 
may already have been fixed.

> I woke up this morning and say this :( . Can anyone give me advice? Do I
> need to start all over once I've figured out whats wrong? Task 3146 out of
> 4734. About 17 hours. Damn..

Don't worry - the 17 hours haven't been wasted. It only rebuilds the bits that 
have changed since last time, so most of the 3146 jobs completed so far won't 
need to be done again.

More information about the devel mailing list